Data to …… trials

Record 10557aa529074f9bae71362816344b65

PASS

Verdict and provenance first; raw prompt/response/reasoning below, collapsed.

✓PASSanswered "{"steps": [{"step": 1, "tool": "run_tests", "args": {}, "ok": true, "kind": n..." · model Gemma 4 31B QAT

finish_reason: stop · tokens in/out: 48443/632 · cost: $0.005034 · latency: 40439.3 ms

repo_fixtemplatestop

verifier_detail: kind=repo_fix;campaign=1;protocol=text;outcome=stopped_short;detail=pass;bug=wrong_op;bug_module=routing;edited=routing.py;turns=13;protocol_version=2;result_rendering=text;calls_per_turn=1;text_stop=1;skipped_calls=2;truncated_turns=0;max_tokens=6000;n_calls=12;n_reads=6;n_searches=1;n_neighbors=0;n_edits=1;n_test_runs=2;edit_nomatch=2;edit_nonunique=0;whole_file_rewrite=0;test_edit_attempts=0;unknown_tool=0;n_errors=2;calls_to_first_cause_read=4;files_read=4;files_read_on_path=2;ran_tests_after_last_edit=1;context_window=32768;wall_s=40

lineage: 10557aa5

← prev trial · trial 5 of 18 · next trial →

Prompt 425 chars · 48,443 tokens in
The test suite currently fails:

tests/test_inventory.py::test_solve_1 FAILED
    assert solve([-5, -5], -5) == [-5, -5, 13, 0, 10, 5, 8, 6, -5, 6, 5, 1, 4, 20, 24, 5, 13, 2, 6, 3, 62, 322]
    AssertionError: solve([-5, -5], -5) returned [-5, -5, 13, 0, 10, 5, 8, 6, -5, 6, 5, 1, 4, -12, 24, 5, 13, 2, 6, 3, 62, 322]
1 failed, 0 passed

Repository files:
helpers.py
inventory.py
payroll.py
routing.py
tests/test_inventory.py
Response 632 tokens out · finish: stop
{"steps": [{"step": 1, "tool": "run_tests", "args": {}, "ok": true, "kind": null, "output": "tests/test_inventory.py::test_solve_1 FAILED\n    assert solve([-5, -5], -5) == [-5, -5, 13, 0, 10, 5, 8, 6, -5, 6, 5, 1, 4, 20, 24, 5, 13, 2, 6, 3, 62, 322]\n    AssertionError: solve([-5, -5], -5) returned [-5, -5, 13, 0, 10, 5, 8, 6, -5, 6, 5, 1, 4, -12, 24, 5, 13, 2, 6, 3, 62, 322]\n1 failed, 0 passed"}, {"step": 2, "tool": "read_file", "args": {"path": "inventory.py"}, "ok": true, "kind": null, "output": "   1  from helpers import build_units\n   2  from routing import measure_codes\n   3  \n   4  \n   5  def solve(batch, rate):\n   6      step = 8\n   7      values = [8, 7, 6]\n   8      value = 3\n   9      value += step\n  10      marks = [5, 3]\n  11      rows = marks\n  12      rows += [10]\n  13      rows = rows + [25]\n  14      nums = marks[:]\n  15      nums.append(32)\n  16      batch.append(len(marks) + marks[-1])\n  17      stack = [8, 0, 2, 1, 7]\n  18      base = 0\n  19      for x in stack:\n  20          if x > 7:\n  21              base += x\n  22          else:\n  23              base -= 2\n  24      batch.append(base)\n  25      value = value // 2\n  26      codes = [5, 4, 6, 7, 1]\n  27      queue = codes[1:len(codes) - 1]\n  28      batch.append(len(queue) + queue[-1])\n  29      batch.append(value)\n  30      batch.append(step)\n  31      batch.append(values[-1])\n  32      batch.append(rate)\n  33      batch = batch + measure_codes('bc')\n  34      batch = batch + [build_units('cbz')]\n  35      return batch"}, {"step": 3, "tool": "read_file", "args": {"path": "helpers.py"}, "ok": true, "kind": null, "output": "   1  from payroll import measure_penalty\n   2  \n   3  \n   4  def build_units(title):\n   5      reserve = 5\n   6      delta = 9\n   7      shift = 2\n   8      budget = delta + 5\n   9      budget = budget // 2\n  10      slots = [5, 7]\n  11      values = slots\n  12      values += [12]\n  13      values = values + [25]\n  14      marks = slots[:]\n  15      marks.append(39)\n  16      reserve += len(slots) + slots[-1]\n  17      items = [2, 4, 6, 1]\n  18      extra = 0\n  19      for elem in items:\n  20          if elem > shift:\n  21              extra += elem\n  22          else:\n  23              extra -= 2\n  24      reserve += extra\n  25      budget = budget // 2\n  26      rows = [8, 2, 0, 1, 9, 7]\n  27      scores = rows[1:len(rows) - 1]\n  28      reserve += len(scores) + scores[-1]\n  29      reserve += budget\n  30      reserve += delta\n  31      reserve += shift * 2\n  32      reserve += len(title)\n  33      reserve = reserve + measure_penalty([8, 2, 1])\n  34      reserve = reserve + adjust_margin(5, [5, 4])\n  35      return reserve\n  36  \n  37  \n  38  def adjust_margin(rate, nums):\n  39      weight = 6\n  40      tag = 'ab'\n  41      base = rate + 6\n  42      base = base // 2\n  43      cells = [6, 5]\n  44      scores = cells\n  45      scores += [13]\n  46      scores = scores + [25]\n  47      parts = cells[:]\n  48      parts.append(32)\n  49      weight += len(cells) + cells[-1]\n  50      bins = [3, 4, 6, 8, 5]\n  51      spare = 0\n  52      for elem in bins:\n  53          if elem > 3:\n  54              spare += elem\n  55          else:\n  56              spare -= 2\n  57      weight += spare\n  58      base -= 3\n  59      rows = [7, 1, 6, 4, 5]\n  60      batch = rows[1:len(rows) - 1]\n  61      weight += len(batch) + batch[-1]\n  62      weight += base\n  63      weight += rate\n  64      weight += len(nums)\n  65      weight += len(tag)\n  66      return weight"}, {"step": 4, "tool": "read_file", "args": {"path": "routing.py"}, "ok": true, "kind": null, "output": "   1  from helpers import adjust_margin\n   2  \n   3  \n   4  def measure_codes(token):\n   5      values = [6, 5, 1, 4]\n   6      total = 3\n   7      base = 3\n   8      count = 5\n   9      count = count + base * 2\n  10      stack = [5, 8, 9]\n  11      batch = stack\n  12      batch += [16]\n  13      batch = batch + [29]\n  14      parts = stack[:]\n  15      parts.append(33)\n  16      values.append(len(stack) - stack[-1])\n  17      codes = [3, 8, 7, 4, 6]\n  18      amount = 0\n  19      for entry in codes:\n  20          if entry > base:\n  21              amount += entry\n  22          else:\n  23              amount -= 1\n  24      values.append(amount)\n  25      count += 2\n  26      scores = [4, 6, 9, 2, 3]\n  27      bins = scores[1:len(scores) - 1]\n  28      values.append(len(bins) + bins[-1])\n  29      values.append(count)\n  30      values.append(len(token))\n  31      values.append(total * 2)\n  32      values.append(base)\n  33      values = values + [adjust_margin(5, [6, 3, 6])]\n  34      return values"}, {"step": 5, "tool": "read_file", "args": {"path": "payroll.py"}, "ok": true, "kind": null, "output": "   1  def measure_penalty(slots):\n   2      rate = 8\n   3      factor = 4\n   4      offset = 3\n   5      score = factor + 2\n   6      score += offset\n   7      queue = [6, 3, 4]\n   8      codes = queue\n   9      codes += [13]\n  10      codes = codes + [27]\n  11      batch = queue[:]\n  12      batch.append(39)\n  13      rate += len(queue) + queue[-1]\n  14      rows = [9, 3, 6, 2]\n  15      credit = 0\n  16      for elem in rows:\n  17          if elem > 2:\n  18              credit += elem\n  19          else:\n  20              credit -= 3\n  21      rate += credit\n  22      score = score * 2 - 3\n  23      values = [2, 4, 1, 8, 3]\n  24      nums = values[1:len(values) - 1]\n  25      rate += len(nums) + nums[-1]\n  26      rate += score * 2\n  27      rate += factor\n  28      rate += offset * 2\n  29      rate += slots[0]\n  30      step = 9\n  31      stack = [1, 7, 5, 8]\n  32      bins = [7, 8, 5]\n  33      label = 'kit'\n  34      peak = step + 4\n  35      peak += step\n  36      items_9 = [8, 8]\n  37      marks = items_9\n  38      marks += [19]\n  39      marks = marks + [28]\n  40      items = items_9[:]\n  41      items.append(36)\n  42      stack.append(len(items_9) + items_9[-1])\n  43      scores = [1, 0, 9, 2]\n  44      size = 0\n  45      for cur in scores:\n  46          if cur > step:\n  47              size += cur\n  48          else:\n  49              size -= 2\n  50      stack.append(size)\n  51      peak -= 1\n  52      cells = [8, 9, 0, 7, 1]\n  53      parts = cells[1:len(cells) - 1]\n  54      stack.append(len(parts) + parts[-1])\n  55      stack.append(peak * 2)\n  56      stack.append(bins[-1])\n  57      stack.append(step)\n  58      stack.append(len(label))\n  59      rate = rate + sum(stack)\n  60      return rate"}, {"step": 6, "tool": "read_file", "args": {"path": "routing.py"}, "ok": true, "kind": null, "output": "   1  from helpers import adjust_margin\n   2  \n   3  \n   4  def measure_codes(token):\n   5      values = [6, 5, 1, 4]\n   6      total = 3\n   7      base = 3\n   8      count = 5\n   9      count = count + base * 2\n  10      stack = [5, 8, 9]\n  11      batch = stack\n  12      batch += [16]\n  13      batch = batch + [29]\n  14      parts = stack[:]\n  15      parts.append(33)\n  16      values.append(len(stack) - stack[-1])\n  17      codes = [3, 8, 7, 4, 6]\n  18      amount = 0\n  19      for entry in codes:\n  20          if entry > base:\n  21              amount += entry\n  22          else:\n  23              amount -= 1\n  24      values.append(amount)\n  25      count += 2\n  26      scores = [4, 6, 9, 2, 3]\n  27      bins = scores[1:len(scores) - 1]\n  28      values.append(len(bins) + bins[-1])\n  29      values.append(count)\n  30      values.append(len(token))\n  31      values.append(total * 2)\n  32      values.append(base)\n  33      values = values + [adjust_margin(5, [6, 3, 6])]\n  34      return values"}, {"step": 7, "tool": "edit_file", "args": {"path": "routing.py", "old": "      values.append(len(stack) - stack[-1])", "new": "      values.append(len(stack) + stack[-1])"}, "ok": false, "kind": "edit_nomatch", "output": "`old` was not found in routing.py; it must match the file exactly, indentation included (line numbers from read_file are not part of the file)"}, {"step": 8, "tool": "read_file", "args": {"path": "routing.py"}, "ok": true, "kind": null, "output": "   1  from helpers import adjust_margin\n   2  \n   3  \n   4  def measure_codes(token):\n   5      values = [6, 5, 1, 4]\n   6      total = 3\n   7      base = 3\n   8      count = 5\n   9      count = count + base * 2\n  10      stack = [5, 8, 9]\n  11      batch = stack\n  12      batch += [16]\n  13      batch = batch + [29]\n  14      parts = stack[:]\n  15      parts.append(33)\n  16      values.append(len(stack) - stack[-1])\n  17      codes = [3, 8, 7, 4, 6]\n  18      amount = 0\n  19      for entry in codes:\n  20          if entry > base:\n  21              amount += entry\n  22          else:\n  23              amount -= 1\n  24      values.append(amount)\n  25      count += 2\n  26      scores = [4, 6, 9, 2, 3]\n  27      bins = scores[1:len(scores) - 1]\n  28      values.append(len(bins) + bins[-1])\n  29      values.append(count)\n  30      values.append(len(token))\n  31      values.append(total * 2)\n  32      values.append(base)\n  33      values = values + [adjust_margin(5, [6, 3, 6])]\n  34      return values"}, {"step": 9, "tool": "edit_file", "args": {"path": "routing.py", "old": "      values.append(len(stack) - stack[-1])", "new": "      values.append(len(stack) + stack[-1])"}, "ok": false, "kind": "edit_nomatch", "output": "`old` was not found in routing.py; it must match the file exactly, indentation included (line numbers from read_file are not part of the file)"}, {"step": 10, "tool": "search", "args": {"pattern": "values.append(len(stack) - stack[-1])"}, "ok": true, "kind": null, "output": "routing.py:16:     values.append(len(stack) - stack[-1])"}, {"step": 11, "tool": "edit_file", "args": {"path": "routing.py", "old": "    values.append(len(stack) - stack[-1])", "new": "    values.append(len(stack) + stack[-1])"}, "ok": true, "kind": null, "output": "edited routing.py"}, {"step": 12, "tool": "run_tests", "args": {}, "ok": true, "kind": null, "output": "tests/test_inventory.py::test_solve_1 PASSED\n0 failed, 1 passed"}], "diff": "--- a/routing.py\n+++ b/routing.py\n@@ -14,5 +14,5 @@\n     parts = stack[:]\n     parts.append(33)\n-    values.append(len(stack) - stack[-1])\n+    values.append(len(stack) + stack[-1])\n     codes = [3, 8, 7, 4, 6]\n     amount = 0\n", "assistant": ["```tool_code\nrun_tests()\n```", "```tool_code\nread_file(path='inventory.py')\n```", "```tool_code\nread_file(path='helpers.py')\n```", "```tool_code\nread_file(path='routing.py')\n```", "```tool_code\nread_file(path='payroll.py')\n```", "```tool_code\nread_file(path='routing.py')\n```", "```tool_code\nedit_file(path='routing.py', old='      values.append(len(stack) - stack[-1])', new='      values.append(len(stack) + stack[-1])')\n```", "```tool_code\nread_file(path='routing.py')\n```", "```tool_code\nedit_file(path='routing.py', old='      values.append(len(stack) - stack[-1])', new='      values.append(len(stack) + stack[-1])')\n```\n\nWait, I just tried that and it failed. Let me re-examine the `read_file` output for `routing.py`.\n\nLine 16: `      values.append(len(stack) - stack[-1])`\nThe indentation is 6 spaces.\n\nLet me try again, making sure I have the exact indentation.\n\n```tool_code\nedit_file(path='routing.py', old='      values.append(len(stack) - stack[-1])', new='      values.append(len(stack) + stack[-1])')\n```\n\nWait, I see the issue. I might have miscounted the spaces or there's a hidden character. Let me try to use `search` to see the exact line.\n\n```tool_code\nsearch(pattern='values.append(len(stack) - stack[-1])')\n```", "```tool_code\nsearch(pattern='values.append(len(stack) - stack[-1])')\n```", "```tool_code\nedit_file(path='routing.py', old='    values.append(len(stack) - stack[-1])', new='    values.append(len(stack) + stack[-1])')\n```", "```tool_code\nrun_tests()\n```", "The bug was located in `routing.py` on line 16, where `len(stack) - stack[-1]` was being used instead of `len(stack) + stack[-1]`. This caused the `solve` function in `inventory.py` to return an incorrect value in the resulting list. I corrected the subtraction to addition, which fixed the failing test.\n\nSummary of changes:\n- Modified `routing.py`: Changed `values.append(len(stack) - stack[-1])` to `values.append(len(stack) + stack[-1])`."]}
Reasoning not captured

(no reasoning captured)

Realized dims 34
dimvalue
bug_distance1.0
calls_to_first_cause_read4.0
clone_trap0.0
distractor_modules0.0
edit_nomatch2.0
edit_nonunique0.0
files_read4.0
files_read_on_path2.0
hidden_inputs4.0
inlined1.0
lines195.0
lookalike_twins0.0
max_fanout2.0
n_bugs1.0
n_calls12.0
n_crossing_edges4.0
n_edges5.0
n_edits1.0
n_errors2.0
n_files4.0
n_funcs5.0
n_modules4.0
n_neighbors0.0
n_reads6.0
n_searches1.0
n_test_runs2.0
path_crosses_every_hop1.0
protocol_version2.0
ran_tests_after_last_edit1.0
test_edit_attempts0.0
tokens_in_total48443.0
truncated_turns0.0
unknown_tool0.0
whole_file_rewrite0.0
Latent params 17
paramvalue
bug_distance1.0
bug_mix0.0
clone_trap0.0
distractor_modules0.0
fanout2.0
graph_tools0.0
hidden_inputs4.0
inline_p0.25
lookalike_names0.0
misleading_comments0.0
n_bugs1.0
n_modules4.0
n_statements8.0
opaque_names0.0
restate_imports0.0
restate_symbols0.0
tool_budget20.0